Age at Presentation,Date of Presentation,Gender,Insurance,Race,Language,BMI,Obesity (BMI>30),DM,HTN,HL,CAD,NASH,Asthma,COPD,First Stone Event,Previous Passed Stone,PreviousStone Procedure,Largest stone size (mm),Staghorn,Obstructing stone?,Number of Stone,Urology Consult Note,Surgery Type,Immediate OR? (within 6 hrs of Urology consult),Discharged home with MET,WBC at presentation,Nit + on UA,LE on UA,Number of WBC on UA,Bact on UA?,Positive Ucx?,Second ER visit within a month?,How many days later did he represent?,What was their disposition after representation?,Complication?,Clavien Grade,Complication comment,Imaging,Temp>38 at presentatin,AKI (Cr greater than 0.3 in 48 hrs or 1.5x baseline)?
60,2019-03-02,0,2,0.0,0,25.0,0.0,0,0,0,0,0,0,0,0.0,1.0,0.0,7.5,0.0,1.0,5.0,1,0,0,1,10.1,0.0,0.0,1.0,,0.0,0,,,0.0,,,1.0,0,1.0
57,2019-03-07,0,1,0.0,0,23.0,0.0,0,0,0,0,0,0,0,0.0,,1.0,3.0,0.0,0.0,3.0,1,0,0,1,9.0,0.0,0.0,,,0.0,1,13.0,0.0,0.0,,,2.0,0,0.0
76,2019-03-02,0,3,0.0,0,29.0,0.0,0,1,1,0,0,0,0,1.0,0.0,0.0,4.0,0.0,1.0,1.0,1,1,0,0,7.5,0.0,1.0,32.0,0.0,0.0,0,,,0.0,,,1.0,0,0.0
37,2019-03-03,1,1,3.0,5,26.0,0.0,0,0,0,0,0,0,0,,,,11.0,0.0,0.0,10.0,0,0,0,1,6.1,0.0,0.0,0.0,0.0,0.0,0,,,0.0,,,1.0,0,0.0
51,2019-03-03,1,1,1.0,0,45.0,1.0,0,0,0,1,0,0,0,0.0,,,2.0,0.0,0.0,,0,0,0,1,,0.0,0.0,20.0,0.0,0.0,0,,,0.0,,,0.0,0,
70,2019-03-03,1,3,0.0,0,27.0,0.0,0,0,1,0,0,0,0,0.0,,1.0,16.0,1.0,1.0,2.0,1,1,1,0,11.2,0.0,1.0,17.0,1.0,1.0,0,,,0.0,,,1.0,0,0.0
43,2019-03-03,0,1,2.0,0,32.0,1.0,0,0,0,0,0,0,0,0.0,1.0,0.0,8.0,0.0,1.0,10.0,0,0,0,1,9.7,0.0,0.0,1.0,0.0,0.0,1,9.0,2.0,0.0,,,1.0,0,0.0
31,2019-03-03,1,1,2.0,0,34.0,1.0,1,1,1,0,0,1,0,0.0,0.0,1.0,10.0,0.0,1.0,10.0,0,0,0,1,7.1,0.0,1.0,40.0,0.0,0.0,0,,,0.0,,,2.0,0,0.0
60,2019-03-04,0,2,0.0,0,27.0,0.0,1,1,1,1,0,0,0,,,,10.0,0.0,1.0,1.0,1,1,0,0,12.5,0.0,1.0,47.0,0.0,1.0,0,,,0.0,,,1.0,0,0.0
23,2019-03-04,1,3,1.0,0,37.0,1.0,0,0,0,0,0,1,0,,,,3.0,0.0,1.0,1.0,0,0,0,1,,0.0,1.0,50.0,0.0,0.0,0,,,0.0,,,1.0,0,0.0
72,2019-03-05,0,3,3.0,0,21.0,0.0,1,1,1,1,0,0,0,1.0,0.0,0.0,4.0,0.0,1.0,1.0,0,0,0,1,5.0,0.0,0.0,0.0,0.0,0.0,0,,,0.0,,,1.0,0,0.0
54,2019-03-05,0,1,2.0,1,24.0,0.0,0,0,0,0,0,0,0,1.0,0.0,0.0,4.0,0.0,0.0,3.0,0,0,0,1,11.1,0.0,0.0,0.0,0.0,0.0,0,,,0.0,,,1.0,0,0.0
16,2019-03-06,0,2,0.0,0,25.0,0.0,0,0,0,0,0,0,0,1.0,0.0,0.0,4.0,0.0,1.0,2.0,0,0,0,1,12.7,0.0,0.0,5.0,0.0,0.0,0,,,0.0,,,1.0,0,0.0
60,2019-03-06,0,1,0.0,0,31.0,1.0,1,1,0,0,0,0,0,0.0,,1.0,5.0,0.0,0.0,1.0,0,0,0,1,13.4,0.0,0.0,,,0.0,1,6.0,0.0,0.0,,,1.0,0,0.0
42,2019-03-06,1,2,2.0,0,40.0,1.0,0,0,0,0,0,0,0,0.0,1.0,1.0,5.0,0.0,0.0,5.0,0,0,0,1,,0.0,1.0,,,0.0,0,,,0.0,,,1.0,0,
49,2019-03-06,1,0,2.0,1,29.0,0.0,0,0,0,0,0,0,0,1.0,,0.0,3.0,0.0,0.0,1.0,0,0,0,1,6.7,0.0,0.0,2.0,,0.0,0,,,0.0,,,1.0,0,0.0
21,2019-03-07,0,0,2.0,0,27.0,0.0,0,0,0,0,0,0,0,1.0,,0.0,4.0,0.0,1.0,4.0,0,0,0,1,16.1,0.0,0.0,0.0,0.0,0.0,0,,,0.0,,,1.0,0,0.0
68,2019-03-08,1,3,0.0,0,27.0,0.0,0,0,1,0,0,0,0,0.0,1.0,0.0,5.0,0.0,1.0,1.0,0,0,0,1,11.0,0.0,0.0,8.0,0.0,0.0,0,,,0.0,,,1.0,0,0.0
47,2019-03-08,0,2,1.0,0,24.0,0.0,0,0,0,0,0,0,0,1.0,,,25.0,1.0,0.0,1.0,1,2,0,0,8.0,0.0,1.0,11.0,0.0,0.0,0,,,0.0,,,1.0,0,0.0
40,2019-03-09,0,2,0.0,0,38.0,1.0,0,0,0,0,0,0,0,,,,4.0,0.0,1.0,1.0,0,0,0,1,9.7,0.0,0.0,3.0,0.0,1.0,0,,,0.0,,,1.0,0,0.0
56,2019-03-10,1,1,2.0,1,30.0,1.0,0,0,0,0,0,1,0,0.0,1.0,0.0,7.0,0.0,1.0,5.0,1,3,0,0,8.2,0.0,0.0,0.0,0.0,0.0,0,,,0.0,,,1.0,0,1.0
56,2019-03-12,1,2,1.0,0,30.0,1.0,0,0,0,0,0,0,0,,,,4.0,0.0,1.0,3.0,0,0,0,1,9.0,0.0,0.0,,,0.0,0,,,0.0,,,1.0,0,0.0
42,2019-03-14,0,2,0.0,0,34.0,1.0,0,0,0,0,0,0,0,,,,4.0,0.0,1.0,1.0,0,0,0,1,,0.0,0.0,,,0.0,0,,,0.0,,,1.0,0,
35,2019-03-14,1,3,0.0,0,25.0,0.0,0,0,0,0,0,0,0,0.0,1.0,1.0,,,,,0,0,0,1,7.0,0.0,0.0,0.0,0.0,0.0,1,9.0,0.0,0.0,,,2.0,0,0.0
32,2019-03-14,0,0,1.0,5,28.0,0.0,0,0,0,0,0,0,0,0.0,,1.0,8.0,0.0,1.0,1.0,1,0,0,1,8.0,0.0,0.0,0.0,0.0,0.0,0,,,0.0,,,1.0,0,0.0
43,2019-03-03,0,1,2.0,0,32.0,1.0,0,0,0,0,0,0,0,0.0,1.0,0.0,6.0,0.0,1.0,7.0,1,0,0,1,10.5,0.0,0.0,50.0,0.0,1.0,1,11.0,2.0,0.0,,,1.0,0,0.0
73,2019-03-14,0,3,0.0,0,38.0,1.0,0,1,1,0,0,0,0,1.0,0.0,0.0,6.0,0.0,1.0,1.0,1,3,0,0,6.9,0.0,0.0,2.0,0.0,0.0,0,,,0.0,,,1.0,0,0.0
52,2019-03-14,0,2,2.0,1,25.0,0.0,0,0,0,0,0,0,0,0.0,1.0,0.0,6.0,0.0,1.0,11.0,0,0,0,1,1.0,0.0,0.0,10.0,0.0,0.0,0,,,0.0,,,1.0,0,0.0
38,2019-03-15,1,1,2.0,0,39.0,1.0,0,0,0,0,0,0,0,1.0,0.0,0.0,5.0,0.0,1.0,5.0,0,0,0,1,,0.0,0.0,3.0,0.0,0.0,0,,,0.0,,,2.0,0,
49,2019-03-17,1,1,,0,40.0,1.0,0,0,0,0,0,0,0,1.0,0.0,0.0,4.0,0.0,0.0,1.0,0,0,0,1,14.7,0.0,0.0,0.0,0.0,0.0,1,1.0,0.0,0.0,,,1.0,0,0.0
68,2019-03-17,1,3,1.0,0,25.0,0.0,0,1,1,0,0,0,0,1.0,0.0,0.0,3.0,0.0,1.0,1.0,0,0,0,0,12.3,0.0,0.0,0.0,0.0,0.0,1,5.0,0.0,0.0,,,1.0,0,0.0
53,2019-03-18,0,1,1.0,0,23.0,0.0,0,1,0,1,0,0,0,,,,2.0,0.0,0.0,2.0,0,0,0,1,7.8,0.0,0.0,20.0,0.0,0.0,0,,,0.0,,,1.0,0,0.0
32,2019-03-18,0,2,1.0,0,33.0,1.0,0,0,0,0,0,1,0,0.0,,,,,,,0,0,0,1,,0.0,0.0,,,0.0,1,12.0,0.0,0.0,,,0.0,0,
33,2019-03-19,1,2,1.0,0,24.0,0.0,0,0,0,0,0,0,0,,,,5.0,0.0,1.0,4.0,0,0,0,1,8.2,0.0,0.0,5.0,1.0,1.0,0,,,0.0,,,1.0,0,0.0
43,2019-03-19,1,2,0.0,0,39.0,1.0,0,1,0,0,0,0,0,1.0,0.0,0.0,8.0,0.0,1.0,1.0,1,0,0,1,13.8,0.0,0.0,10.0,0.0,0.0,0,,,0.0,,,1.0,0,0.0
62,2019-03-22,0,2,0.0,0,24.0,0.0,0,1,1,0,0,0,0,0.0,1.0,0.0,5.0,0.0,1.0,17.0,0,0,0,1,7.9,0.0,0.0,2.0,0.0,0.0,0,,,0.0,,,1.0,0,1.0
25,2019-03-22,1,0,2.0,0,36.0,1.0,0,0,0,0,0,0,0,1.0,0.0,0.0,5.0,0.0,1.0,3.0,0,0,0,1,7.0,0.0,0.0,0.0,0.0,0.0,0,,,0.0,,,1.0,0,0.0
69,2019-03-24,1,3,,0,29.0,0.0,0,1,0,0,0,0,0,0.0,,1.0,15.0,1.0,1.0,1.0,1,2,0,0,10.1,0.0,1.0,11.0,0.0,1.0,0,,,0.0,,,1.0,0,1.0
36,2019-03-23,1,2,0.0,0,23.0,0.0,0,0,0,0,0,0,0,0.0,0.0,0.0,4.0,0.0,0.0,4.0,0,0,0,1,8.7,0.0,0.0,,,0.0,0,,,0.0,,,2.0,0,0.0
71,2019-03-23,0,2,2.0,0,34.0,1.0,1,1,1,0,0,0,0,,,,10.0,1.0,1.0,3.0,0,0,0,1,11.5,0.0,0.0,,,0.0,0,,,0.0,,,1.0,0,
56,2019-03-23,0,1,0.0,0,26.0,0.0,0,0,0,0,0,0,0,0.0,,1.0,11.0,1.0,0.0,3.0,1,0,0,0,5.4,1.0,1.0,180.0,0.0,0.0,0,,,0.0,,,1.0,0,0.0
35,2019-03-23,0,0,0.0,0,27.0,0.0,0,1,0,0,0,0,0,1.0,0.0,0.0,5.0,0.0,0.0,1.0,0,0,0,1,10.8,0.0,0.0,1.0,0.0,0.0,0,,,0.0,,,1.0,0,0.0
41,2019-03-23,1,2,0.0,0,20.0,0.0,0,0,0,0,0,0,0,0.0,,,4.0,0.0,1.0,3.0,0,0,0,1,6.2,0.0,0.0,,,0.0,0,,,0.0,,,1.0,0,0.0
51,2019-03-24,0,0,1.0,0,26.0,0.0,0,0,0,0,0,0,0,1.0,0.0,0.0,4.0,0.0,1.0,1.0,0,0,0,1,10.3,0.0,0.0,0.0,0.0,0.0,0,,,0.0,,,1.0,0,1.0
47,2019-03-24,0,2,2.0,0,28.0,0.0,0,0,0,0,0,0,0,1.0,0.0,0.0,3.0,0.0,1.0,3.0,0,0,0,1,12.5,0.0,0.0,,,0.0,0,,,0.0,,,1.0,0,0.0
58,2019-03-24,1,3,0.0,0,22.0,0.0,0,0,0,0,0,0,1,0.0,,1.0,6.0,0.0,0.0,7.0,1,3,0,0,8.0,1.0,1.0,180.0,1.0,1.0,0,,,0.0,,,1.0,0,0.0
52,2019-03-24,0,2,4.0,0,36.0,1.0,1,1,1,1,0,0,0,1.0,0.0,0.0,6.0,0.0,1.0,1.0,0,0,0,1,,0.0,0.0,5.0,0.0,0.0,0,,,0.0,,,1.0,0,
69,2019-03-24,0,3,0.0,0,28.0,0.0,0,1,1,0,0,0,0,1.0,0.0,0.0,5.0,0.0,0.0,1.0,0,0,0,1,5.7,0.0,0.0,11.0,0.0,0.0,0,,,0.0,,,1.0,0,0.0
60,2019-03-25,1,0,1.0,0,35.0,1.0,0,0,0,0,0,0,0,0.0,1.0,,7.0,0.0,0.0,2.0,0,0,0,1,5.1,0.0,0.0,0.0,0.0,0.0,0,,,0.0,,,1.0,0,0.0
39,2019-03-25,0,0,2.0,1,37.0,1.0,1,0,0,0,0,0,0,1.0,0.0,0.0,11.0,0.0,1.0,1.0,1,3,0,0,14.5,0.0,0.0,3.0,0.0,0.0,0,,,0.0,,,1.0,0,0.0
33,2019-03-25,1,1,1.0,0,33.0,1.0,0,0,0,0,0,0,0,1.0,0.0,0.0,3.0,0.0,0.0,2.0,0,0,0,0,6.8,0.0,0.0,,,0.0,0,,,0.0,,,1.0,0,0.0
48,2019-03-25,1,2,1.0,0,32.0,1.0,1,1,0,0,0,0,1,0.0,,1.0,7.0,0.0,1.0,3.0,1,3,0,0,9.0,0.0,1.0,10.0,0.0,0.0,0,,,0.0,,,1.0,0,0.0
56,2019-03-26,1,2,0.0,0,32.0,1.0,0,0,1,0,0,0,0,1.0,0.0,0.0,7.0,0.0,1.0,1.0,0,0,0,1,12.3,0.0,0.0,1.0,,0.0,0,,,0.0,,,1.0,0,0.0
50,2019-03-26,1,1,0.0,0,22.0,0.0,0,0,0,0,0,0,0,1.0,0.0,0.0,7.0,0.0,1.0,2.0,1,1,0,0,10.7,0.0,0.0,14.0,,0.0,0,,,0.0,,,1.0,0,0.0
38,2019-03-26,0,1,1.0,0,36.0,1.0,0,1,0,0,0,1,0,0.0,1.0,0.0,3.0,0.0,1.0,3.0,1,0,0,1,7.1,0.0,0.0,0.0,0.0,0.0,0,,,0.0,,,1.0,0,0.0
41,2019-03-28,0,2,2.0,0,32.0,1.0,1,1,1,0,0,0,0,1.0,0.0,0.0,3.0,0.0,1.0,1.0,0,0,0,1,13.5,0.0,0.0,0.0,,0.0,0,,,0.0,,,1.0,0,0.0
60,2019-03-29,1,3,2.0,1,26.0,0.0,0,1,0,0,0,0,0,0.0,,1.0,,,1.0,,0,0,0,1,6.0,0.0,0.0,0.0,0.0,0.0,0,,,0.0,,,2.0,0,0.0
30,2019-03-29,1,2,2.0,1,18.0,0.0,0,0,0,0,0,0,0,1.0,0.0,0.0,2.0,0.0,0.0,1.0,0,0,0,1,,0.0,0.0,,,0.0,1,28.0,0.0,0.0,,,1.0,0,
70,2019-03-30,1,3,0.0,0,33.0,1.0,0,1,1,0,0,0,0,1.0,0.0,0.0,6.0,0.0,1.0,1.0,0,0,0,1,9.0,0.0,0.0,,,0.0,0,,,0.0,,,1.0,0,0.0
41,2019-03-30,1,2,0.0,0,31.0,1.0,0,0,0,0,0,0,0,1.0,0.0,0.0,3.0,0.0,0.0,2.0,0,0,0,1,12.5,0.0,0.0,1.0,0.0,0.0,0,,,0.0,,,1.0,0,0.0
50,2019-03-30,1,1,1.0,0,62.0,1.0,1,1,1,0,0,1,1,0.0,,1.0,7.0,0.0,1.0,1.0,1,0,0,1,4.0,0.0,0.0,,,0.0,1,2.0,1.0,0.0,,,1.0,0,0.0
25,2019-03-30,1,1,2.0,0,32.0,1.0,0,0,0,0,0,0,0,1.0,0.0,0.0,9.0,0.0,1.0,1.0,1,3,0,0,11.5,0.0,1.0,0.0,0.0,0.0,0,,,0.0,,,1.0,0,0.0
43,2019-03-30,0,1,1.0,0,37.0,1.0,0,0,0,0,0,0,0,1.0,0.0,0.0,5.0,0.0,1.0,7.0,0,0,0,1,8.8,0.0,0.0,,,0.0,0,,,0.0,,,1.0,0,0.0
57,2019-03-31,0,1,0.0,0,23.0,0.0,0,0,0,0,0,0,0,0.0,,1.0,7.0,0.0,0.0,4.0,0,0,0,1,11.5,0.0,0.0,180.0,,0.0,1,12.0,0.0,0.0,,,2.0,0,0.0
55,2019-03-31,0,1,0.0,0,27.0,0.0,0,0,0,0,0,0,0,0.0,1.0,0.0,5.0,0.0,1.0,2.0,0,0,0,1,11.8,0.0,0.0,,,0.0,0,,,0.0,,,1.0,0,0.0
72,2019-04-01,1,3,1.0,0,34.0,1.0,0,1,1,0,0,0,0,1.0,0.0,0.0,21.0,1.0,1.0,2.0,1,0,0,0,7.4,0.0,1.0,20.0,0.0,0.0,0,,,0.0,,,1.0,0,0.0
56,2019-04-01,0,1,,0,23.0,0.0,0,0,1,1,0,0,0,1.0,0.0,0.0,5.0,0.0,1.0,2.0,0,0,0,1,7.0,0.0,1.0,6.0,1.0,0.0,0,,,0.0,,,1.0,0,0.0
41,2019-04-01,0,1,0.0,0,21.0,0.0,0,0,0,0,0,0,0,1.0,0.0,0.0,3.0,0.0,1.0,2.0,0,0,0,1,12.7,,,,,0.0,0,,,0.0,,,1.0,0,0.0
18,2019-04-02,1,1,2.0,0,38.0,1.0,0,0,0,0,0,1,0,1.0,0.0,0.0,6.0,0.0,1.0,1.0,1,3,0,0,18.6,0.0,1.0,30.0,,1.0,0,,,1.0,2.0,post op sepsis,1.0,0,0.0
57,2019-04-02,1,1,0.0,0,39.0,1.0,1,1,1,0,0,0,0,0.0,1.0,0.0,6.0,0.0,0.0,3.0,0,0,0,1,9.4,0.0,0.0,5.0,,0.0,0,,,0.0,,,0.0,0,0.0
42,2019-04-02,0,2,0.0,0,31.0,1.0,0,1,0,0,0,0,0,1.0,0.0,0.0,4.0,0.0,0.0,1.0,0,0,0,1,17.6,0.0,0.0,,,0.0,0,,,0.0,,,1.0,0,0.0
25,2019-04-05,0,1,1.0,0,45.0,1.0,0,0,0,0,0,0,0,1.0,0.0,0.0,,,,,0,0,0,1,5.8,0.0,0.0,0.0,0.0,0.0,0,,,0.0,,,0.0,0,0.0
33,2019-04-05,0,1,1.0,0,24.0,0.0,0,0,0,0,0,0,0,1.0,0.0,0.0,7.0,0.0,1.0,1.0,1,1,0,0,10.5,0.0,0.0,4.0,0.0,0.0,0,,,0.0,,,1.0,0,0.0
60,2019-04-05,0,2,0.0,0,33.0,1.0,0,0,1,0,0,0,0,1.0,0.0,0.0,5.0,0.0,1.0,1.0,1,0,0,1,7.6,0.0,0.0,1.0,,0.0,0,,,0.0,,,1.0,0,1.0
26,2019-04-05,1,1,2.0,1,36.0,1.0,0,0,0,0,0,0,0,1.0,0.0,0.0,2.0,0.0,1.0,1.0,0,0,0,1,13.3,0.0,0.0,5.0,0.0,0.0,0,,,0.0,,,1.0,0,0.0
47,2019-04-05,0,1,2.0,0,29.0,0.0,0,0,1,0,0,1,0,0.0,,1.0,7.0,0.0,1.0,6.0,1,0,0,1,18.4,0.0,1.0,10.0,0.0,0.0,1,2.0,2.0,1.0,1.0,ER with stent colic,1.0,0,0.0
40,2019-04-06,0,1,,0,19.0,0.0,0,0,0,0,0,0,0,1.0,0.0,0.0,3.0,0.0,1.0,3.0,0,0,0,1,12.6,0.0,0.0,,,0.0,0,,,0.0,,,1.0,0,0.0
47,2019-04-07,0,1,2.0,0,31.0,1.0,0,0,1,0,0,0,0,1.0,0.0,0.0,2.0,0.0,1.0,2.0,0,0,0,1,8.1,0.0,0.0,0.0,0.0,0.0,0,,,0.0,,,1.0,0,0.0
44,2019-04-07,0,2,0.0,0,45.0,1.0,0,0,0,0,0,0,0,0.0,1.0,0.0,5.0,0.0,1.0,1.0,0,0,0,1,10.4,0.0,0.0,0.0,,0.0,0,,,0.0,,,1.0,0,0.0
61,2019-04-07,1,1,0.0,0,40.0,1.0,0,0,0,0,0,0,0,0.0,1.0,0.0,8.0,0.0,1.0,6.0,1,0,0,1,7.0,0.0,0.0,0.0,0.0,0.0,0,,,0.0,,,1.0,0,0.0
60,2019-04-07,0,2,0.0,0,32.0,1.0,0,1,0,0,0,0,0,1.0,0.0,0.0,2.0,0.0,0.0,1.0,0,0,0,1,12.5,0.0,0.0,,,0.0,0,,,0.0,,,1.0,0,1.0
34,2019-04-08,0,2,0.0,0,36.0,1.0,0,0,0,0,0,0,0,1.0,0.0,0.0,5.0,0.0,1.0,4.0,0,0,0,1,7.3,0.0,0.0,,,0.0,0,,,0.0,,,1.0,0,0.0
50,2019-04-08,0,1,1.0,0,29.0,0.0,0,1,0,0,0,0,0,0.0,,1.0,5.0,0.0,1.0,10.0,0,0,0,1,11.3,0.0,0.0,1.0,1.0,0.0,1,4.0,0.0,0.0,,,1.0,0,0.0
45,2019-04-08,0,2,0.0,0,25.0,0.0,0,0,0,0,0,0,0,0.0,1.0,0.0,4.0,0.0,1.0,1.0,1,0,0,1,9.7,0.0,0.0,3.0,0.0,0.0,0,,,0.0,,,1.0,0,0.0
76,2019-04-08,0,3,0.0,0,26.0,0.0,0,0,1,0,0,0,0,0.0,,1.0,5.0,0.0,1.0,8.0,1,0,0,1,13.4,0.0,0.0,3.0,0.0,0.0,0,,,0.0,,,1.0,0,0.0
63,2019-04-08,1,3,0.0,0,40.0,1.0,1,1,0,0,0,0,0,1.0,0.0,0.0,5.0,0.0,1.0,1.0,1,1,0,0,7.5,0.0,0.0,0.0,,1.0,1,11.0,0.0,0.0,,,1.0,0,0.0
26,2019-04-08,0,2,2.0,0,22.0,0.0,0,0,0,0,0,0,0,0.0,0.0,1.0,12.0,1.0,0.0,1.0,0,0,0,1,,0.0,1.0,50.0,0.0,0.0,0,,,0.0,,,3.0,0,
57,2019-04-11,0,1,0.0,0,31.0,1.0,0,0,0,1,0,0,0,0.0,1.0,0.0,5.0,0.0,1.0,1.0,1,0,0,1,6.4,0.0,0.0,5.0,0.0,0.0,0,,,0.0,,,1.0,0,0.0
47,2019-04-11,1,2,4.0,5,22.0,0.0,0,1,0,0,0,0,0,1.0,0.0,0.0,16.0,1.0,1.0,5.0,1,2,0,0,16.4,0.0,1.0,180.0,1.0,0.0,0,,,0.0,,,1.0,0,1.0
60,2019-04-12,0,2,0.0,0,36.0,1.0,0,1,1,0,0,0,0,0.0,1.0,1.0,5.0,0.0,1.0,10.0,0,0,0,1,8.6,0.0,0.0,,,0.0,0,,,0.0,,,1.0,0,0.0
48,2019-04-12,0,1,1.0,0,29.0,0.0,0,1,0,0,0,0,0,0.0,,1.0,5.0,0.0,1.0,22.0,0,0,0,0,11.3,0.0,0.0,180.0,1.0,0.0,0,,,0.0,,,1.0,0,0.0
66,2019-04-12,0,2,0.0,0,31.0,1.0,1,0,1,0,0,0,0,1.0,0.0,0.0,9.0,0.0,1.0,1.0,0,0,0,1,7.6,0.0,0.0,0.0,0.0,0.0,0,,,0.0,,,1.0,0,0.0
43,2019-04-12,0,1,3.0,5,28.0,0.0,0,0,1,0,0,0,0,0.0,1.0,1.0,,,,,0,0,0,1,,0.0,0.0,5.0,0.0,0.0,0,,,0.0,,,0.0,0,
42,2019-04-12,1,1,1.0,0,33.0,1.0,0,0,0,0,0,0,0,0.0,,1.0,7.0,0.0,0.0,8.0,1,1,0,0,15.3,0.0,1.0,20.0,0.0,0.0,0,,,0.0,,,1.0,0,0.0
56,2019-04-12,1,1,1.0,0,55.0,1.0,0,1,0,0,0,0,0,0.0,1.0,0.0,,,,,0,0,0,1,13.2,0.0,1.0,20.0,1.0,0.0,0,,,0.0,,,0.0,0,0.0
30,2019-04-12,1,2,2.0,0,31.0,1.0,0,0,0,0,0,0,0,0.0,,1.0,11.0,1.0,1.0,5.0,1,1,0,0,11.7,0.0,1.0,10.0,0.0,1.0,0,,,1.0,1.0,ER with stent colic,1.0,0,0.0
72,2019-04-12,0,3,0.0,0,33.0,1.0,0,1,1,0,0,0,0,0.0,1.0,0.0,4.0,0.0,1.0,2.0,1,0,0,1,9.4,0.0,0.0,1.0,0.0,0.0,0,,,0.0,,,1.0,0,0.0
60,2019-04-13,0,3,,0,28.0,0.0,0,0,0,0,0,0,0,0.0,,1.0,8.0,0.0,0.0,13.0,0,0,0,1,9.6,0.0,0.0,1.0,0.0,0.0,1,14.0,0.0,0.0,,,1.0,0,0.0
49,2019-04-14,1,1,0.0,0,22.0,0.0,0,0,1,0,0,0,0,1.0,0.0,0.0,4.0,0.0,1.0,1.0,0,0,0,0,9.1,0.0,0.0,9.0,0.0,0.0,0,,,0.0,,,1.0,0,0.0
45,2019-04-14,0,1,0.0,0,28.0,0.0,0,0,0,0,0,0,0,0.0,,1.0,5.0,0.0,1.0,3.0,0,0,0,1,7.2,0.0,0.0,1.0,0.0,0.0,1,2.0,2.0,0.0,,,1.0,0,1.0
60,2019-04-15,1,2,0.0,0,33.0,1.0,0,0,1,0,0,0,0,0.0,1.0,0.0,3.0,0.0,0.0,1.0,0,0,0,1,,0.0,0.0,,,0.0,0,,,0.0,,,0.0,0,
25,2019-04-16,1,1,,1,19.0,0.0,0,0,1,0,0,0,0,0.0,,1.0,4.0,0.0,1.0,1.0,1,0,0,1,15.0,0.0,1.0,10.0,0.0,0.0,0,,,0.0,,,1.0,0,0.0
20,2019-04-16,0,1,2.0,0,31.0,1.0,0,0,0,0,0,0,0,1.0,0.0,0.0,2.0,0.0,0.0,2.0,0,0,0,0,8.8,0.0,0.0,0.0,0.0,0.0,0,,,0.0,,,1.0,0,0.0
60,2019-04-16,0,1,0.0,0,32.0,1.0,0,1,1,0,0,0,0,0.0,,,4.0,0.0,1.0,2.0,0,0,0,1,9.0,,,,,0.0,0,,,0.0,,,1.0,0,0.0
59,2019-04-16,1,0,2.0,1,29.0,0.0,1,1,1,0,0,0,0,1.0,0.0,0.0,7.0,0.0,1.0,1.0,0,0,0,1,5.8,0.0,0.0,,,0.0,1,12.0,0.0,0.0,,,1.0,0,0.0
28,2019-04-18,0,2,0.0,0,27.0,0.0,0,0,0,0,0,0,0,0.0,,,10.0,0.0,1.0,1.0,0,0,0,1,,0.0,0.0,2.0,0.0,0.0,0,,,0.0,,,1.0,0,
63,2019-04-19,1,1,0.0,0,28.0,0.0,0,0,0,0,0,0,0,1.0,0.0,0.0,6.0,0.0,1.0,1.0,1,3,0,0,12.6,0.0,0.0,5.0,1.0,0.0,0,,,0.0,,,1.0,0,0.0
50,2019-04-19,1,2,1.0,0,34.0,1.0,0,0,0,0,0,0,0,0.0,,1.0,7.0,0.0,1.0,2.0,0,0,0,1,11.6,0.0,0.0,0.0,0.0,0.0,0,,,0.0,,,1.0,0,0.0
48,2019-04-19,0,1,0.0,0,32.0,1.0,0,0,0,0,0,0,0,1.0,0.0,0.0,3.0,0.0,1.0,2.0,0,0,0,1,4.7,0.0,0.0,,,0.0,0,,,0.0,,,1.0,0,0.0
39,2019-04-19,0,0,3.0,2,24.0,0.0,0,0,0,0,0,0,0,1.0,0.0,0.0,3.0,0.0,1.0,1.0,0,0,0,1,7.4,0.0,0.0,4.0,,0.0,0,,,0.0,,,1.0,0,0.0
22,2019-04-20,0,1,0.0,0,24.0,0.0,0,0,0,0,0,0,0,1.0,0.0,0.0,3.0,0.0,0.0,2.0,0,0,0,1,4.1,0.0,0.0,11.0,0.0,0.0,0,,,0.0,,,1.0,0,0.0
57,2019-04-20,1,1,2.0,1,24.0,0.0,0,0,1,0,0,0,0,1.0,0.0,0.0,2.0,0.0,0.0,1.0,0,0,0,0,,0.0,0.0,1.0,0.0,0.0,0,,,0.0,,,1.0,0,
62,2019-04-20,0,1,0.0,0,26.0,0.0,0,1,1,0,0,0,0,0.0,1.0,,4.0,0.0,1.0,3.0,0,0,0,1,9.6,0.0,0.0,4.0,0.0,0.0,0,,,0.0,,,1.0,0,0.0
31,2019-04-21,1,2,0.0,0,20.0,0.0,0,1,0,0,0,1,0,0.0,,1.0,5.0,0.0,1.0,1.0,0,0,0,1,10.6,0.0,0.0,2.0,0.0,0.0,0,,,0.0,,,1.0,0,0.0
43,2019-04-12,1,0,0.0,0,29.0,0.0,0,0,1,0,0,0,0,0.0,0.0,1.0,4.0,0.0,1.0,1.0,1,1,0,0,10.0,0.0,0.0,10.0,0.0,0.0,0,,,1.0,1.0,stent colic,1.0,0,0.0
89,2019-04-21,0,3,3.0,5,23.0,0.0,0,0,0,0,0,0,0,1.0,0.0,0.0,3.0,0.0,1.0,1.0,0,0,0,1,12.4,0.0,0.0,5.0,1.0,0.0,0,,,0.0,,,1.0,0,
57,2019-04-22,1,1,2.0,1,31.0,1.0,0,0,0,0,0,1,0,,,,5.0,0.0,1.0,1.0,0,0,0,1,8.0,1.0,1.0,2.0,0.0,0.0,0,,,0.0,,,1.0,0,0.0
64,2019-04-24,1,1,1.0,1,33.0,1.0,0,1,0,0,0,0,0,0.0,,1.0,,,,,0,0,0,1,,0.0,0.0,,,0.0,1,13.0,2.0,0.0,,,1.0,0,
45,2019-04-25,0,1,0.0,0,31.0,1.0,0,0,0,0,0,0,0,1.0,0.0,0.0,5.0,0.0,1.0,1.0,0,0,0,1,7.7,0.0,0.0,1.0,0.0,0.0,0,,,0.0,,,1.0,0,0.0
40,2019-04-25,0,2,0.0,0,27.0,0.0,0,0,1,0,0,1,0,1.0,0.0,0.0,4.0,0.0,1.0,3.0,0,0,0,1,11.2,0.0,0.0,2.0,0.0,0.0,0,,,0.0,,,1.0,0,0.0
44,2019-04-25,0,2,,0,20.0,0.0,0,0,0,0,0,0,0,0.0,1.0,0.0,7.0,0.0,1.0,1.0,1,0,0,1,10.0,0.0,0.0,5.0,0.0,0.0,0,,,0.0,,,1.0,0,0.0
52,2019-04-25,0,1,0.0,0,41.0,1.0,1,0,0,0,0,0,0,1.0,0.0,0.0,5.0,0.0,1.0,2.0,0,0,0,1,6.3,0.0,0.0,,,0.0,0,,,0.0,,,1.0,0,0.0
31,2019-04-26,1,1,2.0,0,29.0,0.0,0,0,0,0,0,0,0,,,,,,,,1,1,0,0,8.7,0.0,1.0,180.0,0.0,0.0,0,,,0.0,,,3.0,0,0.0
55,2019-04-26,1,1,0.0,0,28.0,0.0,0,0,0,0,0,0,0,0.0,,,5.0,0.0,1.0,2.0,0,0,0,0,11.9,0.0,0.0,,,0.0,0,,,0.0,,,1.0,0,
39,2019-04-26,0,1,0.0,0,24.0,0.0,0,0,0,0,0,0,0,0.0,,,5.0,0.0,1.0,2.0,0,0,0,1,6.7,0.0,0.0,,,0.0,0,,,0.0,,,1.0,0,0.0
29,2019-04-26,1,1,2.0,0,27.0,0.0,0,0,0,0,0,0,0,1.0,0.0,0.0,2.0,0.0,0.0,1.0,0,0,0,1,12.4,1.0,1.0,10.0,1.0,1.0,0,,,0.0,,,1.0,0,0.0
71,2019-04-27,1,1,0.0,0,28.0,0.0,0,1,1,0,0,0,0,0.0,1.0,0.0,5.0,0.0,1.0,4.0,0,0,0,1,9.1,0.0,1.0,40.0,0.0,0.0,0,,,0.0,,,1.0,0,0.0
39,2019-04-28,1,1,5.0,4,25.0,0.0,0,0,0,0,0,0,0,1.0,0.0,0.0,5.0,0.0,0.0,1.0,0,0,0,1,4.0,0.0,0.0,2.0,,0.0,1,27.0,0.0,0.0,,,1.0,0,0.0
49,2019-04-28,0,2,1.0,1,22.0,0.0,0,0,1,0,0,0,0,1.0,0.0,0.0,5.0,0.0,0.0,18.0,0,0,0,1,7.1,0.0,0.0,1.0,0.0,0.0,0,,,0.0,,,1.0,0,0.0
29,2019-04-29,1,1,1.0,0,40.0,1.0,0,0,0,0,0,0,0,0.0,,1.0,10.0,0.0,1.0,2.0,1,2,0,0,12.5,0.0,1.0,100.0,0.0,1.0,0,,,0.0,,,1.0,1,0.0
44,2019-04-30,1,1,,0,19.0,0.0,0,0,0,0,0,0,0,0.0,1.0,0.0,2.0,0.0,1.0,2.0,0,0,0,1,4.4,0.0,0.0,,,0.0,1,13.0,0.0,0.0,,,1.0,0,0.0
62,2019-05-01,1,1,1.0,0,31.0,1.0,1,1,1,0,0,0,0,1.0,0.0,0.0,4.0,0.0,0.0,2.0,0,0,0,0,,0.0,0.0,0.0,0.0,0.0,0,,,,,,1.0,0,
36,2019-05-01,0,0,0.0,0,39.0,1.0,0,0,0,0,0,0,0,0.0,1.0,0.0,6.0,0.0,1.0,3.0,1,0,0,1,18.0,0.0,0.0,6.0,1.0,0.0,0,,,,,,1.0,0,0.0
63,2019-05-01,0,1,2.0,1,35.0,1.0,0,1,1,0,0,0,0,0.0,1.0,0.0,7.0,0.0,1.0,1.0,0,0,0,1,9.0,0.0,0.0,0.0,0.0,0.0,0,,,,,,1.0,0,1.0
41,2019-05-03,0,1,1.0,0,25.0,0.0,0,0,0,0,0,1,0,0.0,1.0,,8.0,0.0,0.0,1.0,0,0,0,1,,0.0,0.0,0.0,0.0,0.0,0,,,,,,1.0,0,
53,2019-05-04,1,2,0.0,0,28.0,0.0,0,1,1,0,0,0,0,0.0,,1.0,6.0,0.0,1.0,1.0,1,1,0,1,7.0,0.0,1.0,180.0,1.0,1.0,1,2.0,2.0,,,,1.0,0,0.0
63,2019-05-04,0,2,0.0,0,28.0,0.0,0,0,1,1,0,0,0,0.0,1.0,1.0,6.0,0.0,0.0,5.0,0,0,0,1,6.0,0.0,0.0,4.0,1.0,0.0,0,,,,,,1.0,0,0.0
52,2019-05-04,0,1,1.0,0,50.0,1.0,0,1,1,1,0,0,0,1.0,0.0,0.0,2.0,0.0,0.0,1.0,0,0,0,1,6.0,0.0,0.0,0.0,0.0,0.0,0,,,,,,1.0,0,0.0
73,2019-05-05,0,3,0.0,0,37.0,1.0,1,1,0,1,0,0,0,0.0,,1.0,10.0,0.0,1.0,3.0,0,0,0,1,12.0,0.0,1.0,16.0,1.0,1.0,0,,,,,,1.0,0,1.0
48,2019-05-05,0,3,0.0,0,24.0,0.0,0,0,0,0,0,1,0,0.0,1.0,1.0,5.0,0.0,1.0,3.0,0,1,0,1,10.0,0.0,0.0,1.0,1.0,0.0,1,2.0,2.0,,,,1.0,0,0.0
89,2019-05-06,1,3,0.0,0,31.0,1.0,0,0,0,0,0,0,0,1.0,0.0,0.0,5.0,0.0,1.0,3.0,1,0,0,1,6.0,0.0,0.0,180.0,1.0,0.0,0,,,,,,1.0,0,0.0
51,2019-05-06,0,0,2.0,1,31.0,1.0,0,0,0,0,0,0,0,1.0,0.0,0.0,13.0,0.0,0.0,1.0,1,0,0,0,13.0,0.0,1.0,5.0,1.0,0.0,0,,,,,,1.0,0,0.0
63,2019-05-07,1,2,0.0,0,32.0,1.0,0,0,1,0,0,0,0,0.0,1.0,1.0,8.0,0.0,1.0,1.0,1,3,1,0,3.0,0.0,0.0,0.0,0.0,0.0,0,,,,,,1.0,0,0.0
63,2019-05-08,0,1,0.0,0,34.0,1.0,0,1,1,0,0,0,0,0.0,1.0,1.0,5.0,0.0,1.0,1.0,0,0,0,1,6.0,0.0,0.0,0.0,0.0,0.0,0,,,,,,1.0,0,
45,2019-05-08,0,1,5.0,4,31.0,1.0,0,0,1,0,0,0,0,0.0,1.0,0.0,5.0,0.0,1.0,3.0,0,0,0,1,5.0,0.0,0.0,0.0,0.0,0.0,0,,,,,,1.0,0,0.0
17,2019-05-08,0,0,2.0,1,26.0,0.0,0,0,0,0,0,0,0,1.0,0.0,0.0,4.0,0.0,0.0,1.0,0,0,0,1,8.0,0.0,1.0,0.0,0.0,0.0,0,,,,,,1.0,0,0.0
17,2019-05-09,1,1,2.0,0,40.0,1.0,0,0,0,0,0,0,0,1.0,0.0,0.0,,,,,0,0,0,0,13.0,0.0,0.0,6.0,1.0,0.0,0,,,,,,1.0,0,0.0
70,2019-05-09,0,3,,0,30.0,1.0,0,1,1,1,0,0,0,0.0,1.0,0.0,6.0,0.0,1.0,1.0,0,0,0,1,8.0,0.0,0.0,3.0,1.0,0.0,0,,,,,,1.0,0,0.0
68,2019-05-10,0,2,1.0,0,28.0,0.0,0,1,1,0,0,1,0,0.0,,1.0,7.0,,,,1,1,0,0,9.0,0.0,0.0,0.0,0.0,0.0,0,,,,,,1.0,0,1.0
43,2019-05-10,1,2,0.0,0,29.0,0.0,0,1,0,0,0,0,0,,,,5.0,0.0,1.0,1.0,0,0,0,1,10.0,0.0,0.0,1.0,1.0,0.0,1,5.0,0.0,,,,1.0,0,0.0
39,2019-05-10,1,1,,0,23.0,0.0,0,0,0,0,0,0,0,1.0,0.0,0.0,6.0,0.0,1.0,1.0,1,2,0,0,8.0,,,177.0,1.0,1.0,0,,,,,,1.0,0,0.0
62,2019-05-10,0,2,0.0,0,34.0,1.0,0,1,1,0,0,0,0,0.0,1.0,0.0,3.0,0.0,0.0,1.0,0,0,0,1,15.0,0.0,0.0,,1.0,0.0,0,,,,,,1.0,0,0.0
18,2019-05-10,1,1,1.0,0,54.0,1.0,0,0,0,0,0,0,0,1.0,0.0,0.0,5.0,0.0,0.0,4.0,0,0,0,1,12.0,0.0,0.0,0.0,1.0,0.0,0,,,,,,1.0,0,0.0
71,2019-05-11,1,3,2.0,1,26.0,0.0,1,0,0,0,0,1,0,1.0,0.0,0.0,5.0,0.0,0.0,3.0,0,0,0,1,4.0,0.0,0.0,2.0,1.0,0.0,0,,,,,,1.0,0,0.0
33,2019-05-12,1,2,0.0,0,20.0,0.0,0,0,0,0,0,0,0,0.0,1.0,1.0,3.0,0.0,0.0,1.0,0,0,0,1,5.0,0.0,0.0,2.0,1.0,,0,,,,,,1.0,0,0.0
26,2019-05-14,1,2,,0,26.0,0.0,0,0,0,0,0,1,0,0.0,1.0,0.0,10.0,0.0,0.0,2.0,0,0,0,1,5.0,0.0,1.0,10.0,1.0,0.0,0,,,,,,1.0,0,0.0
50,2019-05-15,1,1,1.0,0,58.0,1.0,1,1,1,0,0,1,1,0.0,1.0,1.0,2.0,0.0,1.0,2.0,0,0,0,1,5.0,0.0,0.0,0.0,0.0,0.0,0,,,,,,1.0,0,0.0
68,2019-05-15,1,3,0.0,0,27.0,0.0,0,0,1,0,0,0,0,0.0,1.0,1.0,5.0,0.0,1.0,11.0,0,0,0,1,,0.0,0.0,2.0,0.0,0.0,0,,,,,,1.0,0,
49,2019-05-16,1,3,1.0,0,29.0,0.0,0,1,1,0,0,1,0,0.0,1.0,1.0,6.0,0.0,0.0,4.0,0,0,0,1,7.0,0.0,1.0,0.0,0.0,0.0,0,,,,,,2.0,0,0.0
51,2019-05-16,0,1,0.0,0,23.0,0.0,0,0,0,0,0,0,0,1.0,0.0,0.0,4.0,0.0,0.0,1.0,0,0,0,1,7.0,0.0,0.0,0.0,0.0,0.0,0,,,,,,1.0,0,1.0
25,2019-05-16,1,1,1.0,0,35.0,1.0,0,0,0,0,0,0,0,1.0,0.0,0.0,2.0,0.0,0.0,1.0,0,0,0,1,7.0,1.0,1.0,180.0,1.0,,0,,,,,,1.0,0,0.0
36,2019-05-18,0,2,0.0,0,20.0,0.0,0,0,0,0,0,0,0,0.0,1.0,1.0,,,,,0,0,0,1,,,,,,,0,,,,,,0.0,0,
59,2019-05-18,0,2,0.0,0,31.0,1.0,0,0,0,0,0,0,0,0.0,1.0,0.0,8.0,0.0,1.0,6.0,0,0,0,1,,0.0,0.0,1.0,0.0,0.0,0,,,,,,1.0,0,
30,2019-05-19,0,0,1.0,0,41.0,1.0,0,0,0,0,0,0,0,1.0,0.0,0.0,2.0,0.0,1.0,1.0,0,0,0,1,17.0,0.0,0.0,0.0,0.0,0.0,0,,,,,,1.0,0,1.0
42,2019-05-20,0,1,2.0,0,33.0,1.0,0,0,0,0,1,1,0,0.0,1.0,0.0,2.0,0.0,0.0,3.0,0,0,0,1,,0.0,0.0,0.0,0.0,0.0,0,,,,,,1.0,0,
58,2019-05-20,0,2,1.0,0,42.0,1.0,0,0,0,0,0,0,0,1.0,0.0,0.0,2.0,0.0,1.0,1.0,0,0,0,1,9.0,0.0,0.0,0.0,0.0,0.0,0,,,,,,1.0,0,0.0
42,2019-05-20,1,1,1.0,0,33.0,1.0,0,0,0,0,0,1,0,0.0,1.0,1.0,19.0,0.0,1.0,10.0,1,1,0,0,21.0,0.0,1.0,10.0,0.0,0.0,0,,,,,,1.0,0,0.0
39,2019-05-21,1,1,0.0,0,51.0,1.0,1,1,1,0,0,1,1,1.0,0.0,0.0,8.0,0.0,1.0,1.0,1,3,0,0,12.0,0.0,0.0,5.0,1.0,0.0,0,,,,,,2.0,0,0.0
19,2019-05-21,0,2,1.0,0,27.0,0.0,0,0,0,0,0,1,0,0.0,1.0,0.0,5.0,0.0,1.0,2.0,0,0,0,1,,0.0,0.0,0.0,0.0,0.0,0,,,,,,1.0,0,0.0
24,2019-05-21,0,0,2.0,1,22.0,0.0,0,0,0,0,0,0,0,1.0,0.0,0.0,2.0,0.0,0.0,1.0,0,0,0,1,8.0,0.0,0.0,0.0,0.0,0.0,0,,,,,,2.0,0,0.0
64,2019-05-22,1,2,0.0,0,23.0,0.0,0,0,1,0,0,0,0,0.0,1.0,0.0,5.0,0.0,1.0,3.0,0,0,0,1,9.0,0.0,0.0,0.0,0.0,0.0,0,,,,,,1.0,0,1.0
74,2019-05-23,0,3,,0,31.0,1.0,0,1,1,1,0,1,0,1.0,0.0,0.0,5.0,0.0,1.0,1.0,1,0,0,1,8.0,0.0,0.0,3.0,1.0,,1,2.0,0.0,,,,1.0,0,0.0
35,2019-05-25,0,2,1.0,0,47.0,0.0,0,0,0,0,0,0,0,1.0,0.0,0.0,1.0,0.0,1.0,1.0,0,0,0,1,12.0,0.0,0.0,,1.0,0.0,0,,,,,,1.0,0,1.0
23,2019-05-25,0,1,0.0,0,34.0,1.0,0,1,0,0,0,1,0,1.0,0.0,0.0,2.0,0.0,0.0,0.0,0,0,0,1,8.0,0.0,0.0,1.0,1.0,0.0,0,,,,,,1.0,0,0.0
26,2019-05-25,0,1,1.0,0,20.0,0.0,0,0,0,0,0,0,0,1.0,0.0,0.0,,,,,0,0,0,1,,0.0,1.0,20.0,0.0,0.0,0,,,,,,,0,
23,2019-05-26,1,0,2.0,1,37.0,1.0,1,0,0,0,0,0,0,1.0,0.0,0.0,0.0,0.0,0.0,0.0,0,0,0,1,,0.0,0.0,0.0,0.0,0.0,0,,,,,,2.0,0,
60,2019-05-27,0,3,1.0,0,33.0,1.0,1,0,1,0,0,0,0,0.0,1.0,0.0,3.0,0.0,0.0,1.0,0,0,0,1,11.0,0.0,0.0,0.0,0.0,0.0,0,,,,,,1.0,0,1.0
20,2019-05-27,0,1,1.0,0,21.0,0.0,0,0,0,0,0,0,0,1.0,0.0,0.0,0.0,0.0,0.0,0.0,0,0,0,1,10.0,0.0,0.0,0.0,0.0,0.0,0,,,,,,2.0,0,0.0
37,2019-05-28,1,0,0.0,0,48.0,1.0,0,0,1,1,0,0,0,0.0,1.0,1.0,3.0,0.0,1.0,2.0,0,0,0,1,9.0,0.0,0.0,4.0,1.0,0.0,0,,,,,,1.0,0,0.0
47,2019-05-28,1,1,1.0,0,33.0,1.0,1,1,1,0,0,0,0,1.0,0.0,0.0,4.0,0.0,0.0,0.0,1,0,0,1,11.0,1.0,1.0,180.0,1.0,1.0,0,,,,,,1.0,0,0.0
52,2019-05-29,1,2,0.0,0,38.0,1.0,0,1,0,0,0,0,0,0.0,1.0,0.0,6.0,0.0,1.0,1.0,1,3,0,0,8.0,0.0,0.0,1.0,0.0,0.0,0,,,,,,1.0,0,0.0
26,2019-05-29,1,2,0.0,0,20.0,0.0,0,0,0,0,0,0,0,1.0,0.0,0.0,3.0,0.0,0.0,1.0,0,0,0,1,11.0,0.0,0.0,12.0,1.0,0.0,0,,,,,,1.0,0,0.0
92,2019-05-30,1,3,0.0,0,18.0,0.0,0,1,0,0,0,0,0,1.0,0.0,0.0,2.0,0.0,0.0,1.0,0,0,0,1,9.0,0.0,0.0,0.0,0.0,0.0,0,,,,,,1.0,0,0.0
55,2019-05-30,0,2,,0,40.0,1.0,0,1,1,0,0,0,0,0.0,1.0,0.0,5.0,0.0,1.0,5.0,0,0,0,1,16.0,0.0,0.0,0.0,0.0,0.0,0,,,,,,1.0,0,0.0
51,2019-05-30,0,2,0.0,0,30.0,1.0,0,0,0,0,0,0,0,0.0,0.0,0.0,5.0,0.0,1.0,3.0,0,0,0,1,10.0,0.0,0.0,4.0,0.0,0.0,0,,,,,,1.0,0,1.0
46,2019-05-30,0,2,0.0,0,42.0,1.0,0,0,0,0,0,0,0,0.0,1.0,0.0,5.0,0.0,0.0,4.0,0,0,0,1,8.0,0.0,0.0,10.0,1.0,1.0,0,,,,,,1.0,0,0.0
24,2019-05-31,1,2,0.0,0,25.0,0.0,0,0,0,0,0,0,0,1.0,0.0,0.0,2.0,0.0,0.0,2.0,0,0,0,1,,0.0,1.0,20.0,0.0,1.0,0,,,,,,1.0,0,
48,2019-05-31,0,2,0.0,0,35.0,1.0,0,0,0,0,0,0,0,1.0,1.0,0.0,9.0,0.0,1.0,4.0,1,0,0,1,11.0,0.0,1.0,18.0,1.0,0.0,0,,,,,,1.0,0,0.0